certifiedBy
type: ObjectProperty
domain: TextileProduct
range: Certification
comment: Object property certifiedBy from TextileProduct to Certification.

documentedBy
type: ObjectProperty
domain: Resource
range: Documentation
comment: Object property documentedBy from Resource to Documentation.

foundIn
type: ObjectProperty
domain: PlantSpecies
range: EcologicalContext
comment: Object property foundIn from PlantSpecies to EcologicalContext.

hasMeasurement
type: ObjectProperty
domain: TextileProduct
range: Measurement
comment: Object property hasMeasurement from TextileProduct to Measurement.

hasMotif
type: ObjectProperty
domain: TextileProduct
range: Motif
comment: Object property hasMotif from TextileProduct to Motif.

hasStep
type: ObjectProperty
domain: ProductionEvent
range: ProcessStep
comment: Object property hasStep from ProductionEvent to ProcessStep.

hasSymbolism
type: ObjectProperty
domain: Motif
range: MotifSymbolism
comment: Object property hasSymbolism from Motif to MotifSymbolism.

hasTechnique
type: ObjectProperty
domain: ProcessStep
range: Technique
comment: Object property hasTechnique from ProcessStep to Technique.

originatesFrom
type: ObjectProperty
domain: TextileProduct
range: Location
comment: Object property originatesFrom from TextileProduct to Location.

performs
type: ObjectProperty
domain: Artisan
range: ProductionEvent
comment: Object property performs from Artisan to ProductionEvent.

produces
type: ObjectProperty
domain: ProductionEvent
range: TextileProduct
comment: Object property produces from ProductionEvent to TextileProduct.

protectedUnder
type: ObjectProperty
domain: TextileProduct
range: IntellectualPropertyRight
comment: Object property protectedUnder from TextileProduct to IntellectualPropertyRight.

trainedBy
type: ObjectProperty
domain: Artisan
range: TrainingProgram
comment: Object property trainedBy from Artisan to TrainingProgram.

usesMaterial
type: ObjectProperty
domain: ProcessStep
range: RawMaterial
comment: Object property usesMaterial from ProcessStep to RawMaterial.

usesTool
type: ObjectProperty
domain: ProcessStep
range: Tool
comment: Object property usesTool from ProcessStep to Tool.

artisanAge
type: DatatypeProperty
range: integer
comment: Data property artisanAge with range http://www.w3.org/2001/XMLSchema#integer.

colorDescription
type: DatatypeProperty
range: string
comment: Data property colorDescription with range http://www.w3.org/2001/XMLSchema#string.

confidenceScore
type: DatatypeProperty
range: decimal
comment: Data property confidenceScore with range http://www.w3.org/2001/XMLSchema#decimal.

datePerformed
type: DatatypeProperty
range: date
comment: Data property datePerformed with range http://www.w3.org/2001/XMLSchema#date.

length_cm
type: DatatypeProperty
range: decimal
comment: Data property length_cm with range http://www.w3.org/2001/XMLSchema#decimal.

motifName
type: DatatypeProperty
range: string
comment: Data property motifName with range http://www.w3.org/2001/XMLSchema#string.

provenanceNote
type: DatatypeProperty
range: string
comment: Data property provenanceNote with range http://www.w3.org/2001/XMLSchema#string.

recordingFormat
type: DatatypeProperty
range: string
comment: Data property recordingFormat with range http://www.w3.org/2001/XMLSchema#string.

sourceReference
type: DatatypeProperty
range: anyURI
comment: Data property sourceReference with range http://www.w3.org/2001/XMLSchema#anyURI.

techniqueName
type: DatatypeProperty
range: string
comment: Data property techniqueName with range http://www.w3.org/2001/XMLSchema#string.

threadCount
type: DatatypeProperty
range: integer
comment: Data property threadCount with range http://www.w3.org/2001/XMLSchema#integer.

width_cm
type: DatatypeProperty
range: decimal
comment: Data property width_cm with range http://www.w3.org/2001/XMLSchema#decimal.

Artisan
type: Class
comment: Class representing Artisan in the Pumriang silk ontology.

ArtisanRole
type: Class
comment: Class representing ArtisanRole in the Pumriang silk ontology.

Certification
type: Class
comment: Class representing Certification in the Pumriang silk ontology.

Community
type: Class
comment: Class representing Community in the Pumriang silk ontology.

Documentation
type: Class
comment: Class representing Documentation in the Pumriang silk ontology.

DyeRecipe
type: Class
comment: Class representing DyeRecipe in the Pumriang silk ontology.

EcologicalContext
type: Class
comment: Class representing EcologicalContext in the Pumriang silk ontology.

HistoricalPeriod
type: Class
comment: Class representing HistoricalPeriod in the Pumriang silk ontology.

IntellectualPropertyRight
type: Class
comment: Class representing IntellectualPropertyRight in the Pumriang silk ontology.

Location
type: Class
comment: Class representing Location in the Pumriang silk ontology.

Loom
type: Class
comment: Class representing Loom in the Pumriang silk ontology.

Measurement
type: Class
comment: Class representing Measurement in the Pumriang silk ontology.

Motif
type: Class
comment: Class representing Motif in the Pumriang silk ontology.

MotifSymbolism
type: Class
comment: Class representing MotifSymbolism in the Pumriang silk ontology.

PlantSpecies
type: Class
comment: Class representing PlantSpecies in the Pumriang silk ontology.

ProcessStep
type: Class
comment: Class representing ProcessStep in the Pumriang silk ontology.

ProductionEvent
type: Class
comment: Class representing ProductionEvent in the Pumriang silk ontology.

RawMaterial
type: Class
comment: Class representing RawMaterial in the Pumriang silk ontology.

Resource
type: Class

SilkType
type: Class
comment: Class representing SilkType in the Pumriang silk ontology.

Technique
type: Class
comment: Class representing Technique in the Pumriang silk ontology.

TextileProduct
type: Class
comment: Class representing TextileProduct in the Pumriang silk ontology.

Tool
type: Class
comment: Class representing Tool in the Pumriang silk ontology.

TrainingProgram
type: Class
comment: Class representing TrainingProgram in the Pumriang silk ontology.

Artisan_Akorn
type: NamedIndividual
type: Artisan
performs: ProductionEvent_001
artisanAge: 68
sourceReference: urn:local:akorn-profile

Artisan_OldMaster
type: NamedIndividual
type: Artisan
sourceReference: urn:local:oldmaster-profile

Doc_Video_Dye_001
type: NamedIndividual
type: Documentation
recordingFormat: video/mp4
sourceReference: urn:local:video-dye-001

Location_PumRiang
type: NamedIndividual
type: Location
provenanceNote: Chaiya District, Surat Thani

Plant_Morinda_citrifolia
type: NamedIndividual
type: PlantSpecies
foundIn: EcologicalContext PumRiang
motifName: Morinda dye plant

ProductionEvent_001
type: NamedIndividual
type: ProductionEvent
hasStep: ProcessStep Dye 1
produces: Textile_Krub1
confidenceScore: 0.85
datePerformed: 2023-06-15

Technique_YokDok
type: NamedIndividual
type: Technique
techniqueName: Yok Dok

Textile_Krub1
type: NamedIndividual
type: TextileProduct
documentedBy: Doc_Video_Dye_001
hasMotif: Motif PumRiang 01
originatesFrom: Location_PumRiang
sourceReference: urn:local:textile-krub1
threadCount: 320
width_cm: 90.0